{"text_format":"1","workbook":"xlsx","n_sheets":26,"sheets":["Index","Control","Participant Information","Regulatory Balance Sheet","Own Funds","Operational Risk","Market Risk","Counterparty Default Risk","Life Underwriting Risk","Health Underwriting Risk","Ring-Fenced Fund Adjustment","SCR Summary","MCR Summary","Revenue Account Total","Revenue Account RFF","Investment Data","Quarterly Industry Statistics","Change Analysis","Revenue Account Projected","Expense Analysis","Annual Industry Statistics","Reinsurance Contracts","Insurance Obligations","Data","Raw Data","Validation"],"not_rendered":{"charts":0,"images":1,"macros":1,"external_links":5,"defined_names":451,"comments":1,"pivot_tables":0},"unopened":[],"bounds":{"document_bytes":16777216,"sheet_cells":100000,"rows_first":2000,"rows_last":500,"rows_between":2000,"halvings":0,"cell_chars":16384,"cell_head_chars":4096},"cells_cut":0,"cells_raw":0,"read":"whole","date_system":"1900"}

{"sheet":"Index","index":0,"n_rows":82,"n_cols":7,"rows_kept":82,"cut":false,"hidden":false,"merged":[[18,0,18,11]]}
[1,null,null,"Index"]
[]
[]
["Throughout this Return, 'Regulation' refers to the Insurance (Long-Term Business Valuation and Solvency) Regulations 2021 unless stated otherwise. "]
[]
["Where applicable, the terms used in this Return should be taken to have the same meaning as defined in the Regulations."]
[]
["This Return, \"LTB_Return\" should be completed by the insurer for assets and liabilities relating to all its lines of business."]
[]
[" The signatories required in the Participant Information tab must be Controlled Function Role Holders."]
{"$rows_left_out":73}
{"sheet":"Control","index":1,"n_rows":95,"n_cols":7,"rows_kept":95,"cut":false,"hidden":false,"merged":[[5,2,5,3],[23,2,23,6],[19,2,19,6],[20,2,20,6],[21,2,21,6],[22,2,22,6],[6,2,6,3]]}
[1,null,null,null,"Control"]
[null,null,null,null,null,null,{"$f":"IF(COUNTIF(G7,\"Incomplete\")>0,\"Incomplete\",\"Complete\")","v":"Incomplete"}]
[]
[]
[]
[null,null,"Submission Type",null,"Quarterly"]
[null,null,"Enter Abbreviated Firm Name",null,null,null,{"$f":"IF(ISBLANK(E7),\"Incomplete\",\"Complete\")","v":"Incomplete"}]
[]
[null,null,"File Name",null,"Folder Location",null,"Applicable?*"]
[]
{"$rows_left_out":86}
{"sheet":"Participant Information","index":2,"n_rows":45,"n_cols":7,"rows_kept":45,"cut":false,"hidden":false,"merged":[[29,1,29,4],[22,1,22,4],[24,1,24,4],[26,1,26,4],[27,1,27,4],[28,1,28,4],[25,1,25,4],[8,1,8,4],[3,1,3,6],[9,1,9,2],[13,1,13,4],[21,1,21,4],[30,1,30,4],[31,1,31,4],[42,1,42,4],[43,1,43,4],[44,1,44,4],[35,1,35,4],[38,1,38,4],[32,1,32,4],[40,1,40,4],[34,1,34,4],[36,1,36,4],[37,1,37,4],[39,1,39,4],[33,1,33,4]]}
[1,null,"Participant Information"]
[]
[]
[]
[]
[]
[]
[]
[null," Long-Term Business Insurance Return",null,null,null,null,{"$f":"IF(COUNTIF(G11:G45,\"Incomplete\")>0,\"Incomplete\",\"Complete\")","v":"Incomplete"}]
[null,"Firm Information",null,"Return Version Number","V0.03"]
{"$rows_left_out":36}
{"sheet":"Regulatory Balance Sheet","index":3,"n_rows":164,"n_cols":9,"rows_kept":164,"cut":false,"hidden":false,"merged":[]}
[1,null,null,"Regulatory Balance Sheet"]
[]
[null,null,null,null,null,null,null,null,{"$f":"IF(COUNTIF(I164,\"Incomplete\")>0,\"Incomplete\",\"Complete\")","v":"Complete"}]
[null,"Balance Sheet - Assets",null,"Acc basis        ",null,"Reg basis       "]
[null,null,null,{"$f":"\"'000\"","v":"'000"},null,{"$f":"\"'000\"","v":"'000"}]
[]
[null,"Fixed Assets"]
[]
[null,"Goodwill",null,{"$f":"'Raw Data'!$I$11","v":0},null,0]
[null,"Other intangible assets",null,{"$f":"'Raw Data'!$I$12","v":0},null,{"$f":"'Raw Data'!$I$13","v":0}]
{"$rows_left_out":155}
{"sheet":"Own Funds","index":4,"n_rows":143,"n_cols":13,"rows_kept":143,"cut":false,"hidden":false,"merged":[]}
[1,null,null,"Own Funds"]
[null,null,null,null,null,null,null,null,null,null,null,null,{"$f":"IF(COUNTIF(M9:M144,\"Incomplete\")>0,\"Incomplete\",\"Complete\")","v":"Complete"}]
[]
[null,"Basic Own Funds *",null,"Tier 1",null,"Tier 2",null,"Tier 3",null,"Total"]
[null,null,null,{"$f":"\"'000\"","v":"'000"},null,{"$f":"\"'000\"","v":"'000"},null,{"$f":"\"'000\"","v":"'000"},null,{"$f":"\"'000\"","v":"'000"}]
[]
[null,"Ordinary Share Capital *"]
[]
[null,"Paid up",null,0,null,0,null,0,null,{"$f":"SUM(D9,F9,H9)","v":0},null,null,{"$f":"IF(OR(D9=\"\",F9=\"\"),\"Incomplete\",\"Complete\")","v":"Complete"}]
[null,"Called up",null,0,null,0,null,0,null,{"$f":"SUM(D10,F10,H10)","v":0},null,null,{"$f":"IF(OR(F10=\"\"),\"Incomplete\",\"Complete\")","v":"Complete"}]
{"$rows_left_out":134}
{"sheet":"Operational Risk","index":5,"n_rows":11,"n_cols":15,"rows_kept":11,"cut":false,"hidden":false,"merged":[]}
[1,null,null,null,null,null,"Operational Risk"]
[]
[]
[null,"Operational Risk",null,null,"Current Valuation Date",null,"Previous Valuation Date",null,null,"EXPUL",null,null,"OpPremiums",null,"OpProvisions"]
[null,null,null,null,{"$f":"\"'000\"","v":"'000"},null,{"$f":"\"'000\"","v":"'000"},null,null,{"$f":"\"'000\"","v":"'000"},null,null,{"$f":"\"'000\"","v":"'000"},null,{"$f":"\"'000\"","v":"'000"}]
[]
[null,null,"Total expenses allocated to Unit Linked business",null,{"$f":"'Raw Data'!I6","v":0},null,null,null,null,{"$f":"E7","v":0}]
[]
[null,null,"Earned Premiums ",null,{"$f":"'Raw Data'!I7","v":0},null,{"$f":"'Raw Data'!I8","v":0},null,null,null,null,null,{"$f":"(0.04*E9)+MAX(0,0.04*(E9-1.2*G9))","v":0}]
[]
{"$rows_left_out":2}
{"sheet":"Market Risk","index":6,"n_rows":159,"n_cols":19,"rows_kept":159,"cut":false,"hidden":false,"merged":[]}
[1,null,null,null,null,"Market Risk"]
[]
[null,null,null,null,null,null,null,null,null,null,null,null,null,null,null,null,null,null,{"$f":"IF(COUNTIF(S23,\"Incomplete\")>0,\"Incomplete\",\"Complete\")","v":"Complete"}]
[null,"Market Risk",null,null,null,"Capital",null,"nCapital"]
[null,null,null,null,null,{"$f":"\"'000\"","v":"'000"},null,{"$f":"\"'000\"","v":"'000"}]
[]
[null,"Marketinterest",null,null,null,{"$f":"Mkt_Int","v":0},null,{"$f":"nMkt_Int","v":0}]
[null,"Marketequity",null,null,null,{"$f":"Mkt_Eq","v":0},null,{"$f":"nMkt_Eq","v":0}]
[null,"Marketproperty",null,null,null,{"$f":"Mkt_Prop","v":0},null,{"$f":"nMkt_Prop","v":0}]
[null,"Marketfx",null,null,null,{"$f":"IF(Curr_Simp=\"N\",Mkt_Curr,IF(Curr_Simp=\"Y\",Mkt_Curr_Simp,0))","v":0},null,{"$f":"IF(Curr_Simp=\"N\",nMkt_Curr,IF(Curr_Simp=\"Y\",nMkt_Curr_Simp,0))","v":0}]
{"$rows_left_out":150}
{"sheet":"Counterparty Default Risk","index":7,"n_rows":26,"n_cols":15,"rows_kept":26,"cut":false,"hidden":false,"merged":[]}
[1,null,null,null,null,"Counterparty Default Risk"]
[]
[null,null,null,null,null,null,null,null,null,null,null,null,null,null,{"$f":"IF(COUNTIF(O4:O29,\"Incomplete\")>0,\"Incomplete\",\"Complete\")","v":"Complete"}]
[null,"Counterparty Default Risk",null,null,null,"Capital",null,"nCapital"]
[null,null,null,null,null,{"$f":"\"'000\"","v":"'000"},null,{"$f":"\"'000\"","v":"'000"}]
[]
[null,"Capital Requirement (before diversification effects)",null,null,null,{"$f":"SUM(D23:D24)","v":0},null,{"$f":"SUM(F23:F24)","v":0}]
[]
[null,"Diversification",null,null,null,{"$f":"D26-F7","v":0},null,{"$f":"F26-H7","v":0}]
[]
{"$rows_left_out":17}
{"sheet":"Life Underwriting Risk","index":8,"n_rows":75,"n_cols":16,"rows_kept":75,"cut":false,"hidden":false,"merged":[]}
[1,null,null,null,null,"Life Underwriting Risk"]
[]
[]
[null,"Life Underwriting Risk",null,null,null,"Capital",null,"nCapital"]
[null,null,null,null,null,{"$f":"\"'000\"","v":"'000"},null,{"$f":"\"'000\"","v":"'000"}]
[]
[null,"Lifemortality",null,null,null,{"$f":"Life_Mort","v":0},null,{"$f":"nLife_Mort","v":0}]
[null,"Lifelongevity",null,null,null,{"$f":"Life_Long","v":0},null,{"$f":"nLife_Long","v":0}]
[null,"Lifedis+morb",null,null,null,{"$f":"Life_Dis_Morb","v":0},null,{"$f":"nLife_Dis_Morb","v":0}]
[null,"Lifelapse",null,null,null,{"$f":"Life_Lapse","v":0},null,{"$f":"nLife_Lapse","v":0}]
{"$rows_left_out":66}
{"sheet":"Health Underwriting Risk","index":9,"n_rows":75,"n_cols":16,"rows_kept":75,"cut":false,"hidden":false,"merged":[]}
[1,null,null,null,null,"Health Underwriting Risk"]
[]
[]
[null,"Health Underwriting Risk",null,null,null,"Capital",null,"nCapital"]
[null,null,null,null,null,{"$f":"\"'000\"","v":"'000"},null,{"$f":"\"'000\"","v":"'000"}]
[]
[null,"Healthmortality",null,null,null,{"$f":"Health_Mort","v":0},null,{"$f":"nHealth_Mort","v":0}]
[null,"Healthlongevity",null,null,null,{"$f":"Health_Long","v":0},null,{"$f":"nHealth_Long","v":0}]
[null,"Healthdis+morb",null,null,null,{"$f":"Health_Dis_Morb","v":0},null,{"$f":"nHealth_Dis_Morb","v":0}]
[null,"Healthlapse",null,null,null,{"$f":"Health_Lapse","v":0},null,{"$f":"nHealth_Lapse","v":0}]
{"$rows_left_out":66}
{"sheet":"Ring-Fenced Fund Adjustment","index":10,"n_rows":44,"n_cols":35,"rows_kept":44,"cut":false,"hidden":false,"merged":[]}
[1,null,null,null,null,"Ring-Fenced Fund Adjustment"]
[]
[]
[null,"Do you have ring-fenced Funds?",null,"No"]
[null,"If you have one or more fing-fenced funds, update the below for each ring-fenced fund. You will need to complete the rest of this return as if you don’t have a ring-fenced fund. "]
[null,"You will need to determine the SCR and own-funds for each ring-fenced fund separately and include the results here.",null,null,null,null,null,null,null,null,null,null,null,null,null,null,null,null,null,null,null,null,null,null,null,null,null,null,null,null,null,null,null,null,{"$f":"IF(D4=\"No\",\"Complete\",IF(COUNTIF(AI8:AI45,\"Incomplete\")>0,\"Incomplete\",\"Complete\"))","v":"Complete"}]
[]
[null,"Solvency Capital Requirement",null,"RFF1",null,"RFF2",null,"RFF3",null,"RFF4",null,"RFF5",null,"RFF6",null,"RFF7",null,"RFF8",null,"RFF9",null,"RFF10",null,"RFF11",null,"Not ring-fenced",null,"Total SCR",null,"With no RFF constraint",null,"Total SCR allowing for RFFs"]
[null,null,null,"'000",null,"'000",null,"'000",null,"'000",null,"'000",null,"'000",null,"'000",null,"'000",null,"'000",null,"'000",null,"'000",null,"'000",null,null,null,"'000",null,"'000"]
[]
{"$rows_left_out":35}
{"sheet":"SCR Summary","index":11,"n_rows":54,"n_cols":18,"rows_kept":54,"cut":false,"hidden":false,"merged":[]}
[1,null,null,null,null,"SCR Summary"]
[null,null,null,null,null,null,null,null,null,null,{"$f":"IF(COUNTIF(K7:K56,\"Incomplete\")>0,\"Incomplete\",\"Complete\")","v":"Complete"}]
[null,null,null,null,null,null,null,null,null,null,null,null,null,"For info"]
[null,"SCR",null,null,null,"Capital",null,"nCapital",null,null,null,null,null,"Solvency Capital Requirement (25% Op Risk)",null,null,null,"Capital"]
[null,null,null,null,null,{"$f":"\"'000\"","v":"'000"},null,{"$f":"\"'000\"","v":"'000"}]
[]
[null,"SCR Market",null,null,null,{"$f":"IF('Ring-Fenced Fund Adjustment'!D4=\"Yes\",'Ring-Fenced Fund Adjustment'!AF11,SCR_Market)","v":0},null,{"$f":"nSCR_Market","v":0},null,null,null,null,null,"SCRmarket",null,null,null,{"$f":"SCR_Market","v":0}]
[null,"SCR Default",null,null,null,{"$f":"IF('Ring-Fenced Fund Adjustment'!D4=\"yes\",'Ring-Fenced Fund Adjustment'!AF12,SCR_Default)","v":0},null,{"$f":"nSCR_Default","v":0},null,null,null,null,null,"SCRdefault",null,null,null,{"$f":"SCR_Default","v":0}]
[null,"SCR Life",null,null,null,{"$f":"IF('Ring-Fenced Fund Adjustment'!D4=\"yes\",'Ring-Fenced Fund Adjustment'!AF13,SCR_Life)","v":0},null,{"$f":"nSCR_Life","v":0},null,null,null,null,null,"SCRlife",null,null,null,{"$f":"SCR_Life","v":0}]
[null,"SCR Health",null,null,null,{"$f":"IF('Ring-Fenced Fund Adjustment'!D4=\"yes\",'Ring-Fenced Fund Adjustment'!AF14,'Health Underwriting Risk'!SCR_Health)","v":0},null,{"$f":"'Health Underwriting Risk'!nSCR_Health","v":0},null,null,null,null,null,"SCRhealth",null,null,null,{"$f":"'Health Underwriting Risk'!SCR_Health","v":0}]
{"$rows_left_out":45}
{"sheet":"MCR Summary","index":12,"n_rows":33,"n_cols":9,"rows_kept":33,"cut":false,"hidden":false,"merged":[]}
[1,null,null,null,null,"MCR Summary"]
[]
[null,null,null,null,null,null,null,null,{"$f":"IF(COUNTIF(I6,\"Incomplete\")>0,\"Incomplete\",\"Complete\")","v":"Incomplete"}]
[null,"MCR",null,null,null,{"$f":"\"'000\"","v":"'000"},null,null,{"$f":"IF('Participant Information'!E11=\"GBP\",1,0)","v":0}]
[]
[null,"    Exchange rate",null,null,null,1,"*",null,{"$f":"IF(AND($F$6<1.0000000001,$I$4=0),\"Incomplete\",IF(OR(F6=\"\",F6=0),\"Incomplete\",\"Complete\"))","v":"Incomplete"}]
[]
[null,"SCR",null,null,null,{"$f":"SCR","v":0}]
[null,"SCR excl Mgt Actions",null,null,null,{"$f":"'SCR Summary'!F50","v":0}]
[]
{"$rows_left_out":24}
{"sheet":"Revenue Account Total","index":13,"n_rows":65,"n_cols":26,"rows_kept":65,"cut":false,"hidden":false,"merged":[[4,11,5,15],[3,4,3,8],[3,11,3,15],[4,18,5,18]]}
[1,null,null,null,"Revenue Account Total"]
[]
[null,null,null,null,null,null,null,null,null,null,null,null,null,null,null,null,null,null,null,null,null,null,null,null,null,{"$f":"IF(COUNTIF(Z10:Z68,\"Incomplete\")>0,\"Incomplete\",\"Complete\")","v":"Complete"}]
[null,null,null,null,"Quarter",null,null,null,null,null,null,"YTD",null,null,null,null,null,null,"Plan"]
[null,null,null,null,null,null,{"$f":"IF(OR('Participant Information'!E12=\"\",'Participant Information'!E12=0),0,EDATE('Participant Information'!E12,-3))","v":"00:00:00"},null,null,null,null,{"$f":"G6","v":"00:00:00"},null,null,null,null,null,null,{"$f":"L5","v":"00:00:00"},null,"YTD",null,"Commentary*"]
[null,null,null,null,null,null,{"$f":"QIS_YE_Date","v":"00:00:00"},null,null,null,null,null,null,null,null,null,null,null,null,null,"vs"]
[null,null,null,null,"Gross",null,"Reinsurer's share",null,"Net",null,null,"Gross",null,"Reinsurer's share",null,"Net",null,null,"Net",null,"Plan"]
[null,"Income",null,null,"'000",null,"'000",null,"'000",null,null,"'000",null,"'000",null,"'000",null,null,"'000",null,"%"]
[]
[null,"Written premiums","*",null,{"$f":"SUM(E11:E12)","v":0},null,{"$f":"SUM(G11:G12)","v":0},null,{"$f":"E10-G10","v":0},null,null,{"$f":"SUM(L11:L12)","v":0},null,{"$f":"SUM(N11:N12)","v":0},null,{"$f":"L10-N10","v":0},null,null,{"$f":"SUM(S11:S12)","v":0},null,{"$f":"IF(OR(S10=0,S10=0),0,P10/S10)","v":0},null,null,null,null,{"$f":"IF(OR(E10=\"\",G10=\"\",L10=\"\",N10=\"\",S10=\"\"),\"Incomplete\",\"Complete\")","v":"Complete"}]
{"$rows_left_out":56}
{"sheet":"Revenue Account RFF","index":14,"n_rows":70,"n_cols":18,"rows_kept":70,"cut":false,"hidden":false,"merged":[[6,3,6,14],[8,3,8,7],[8,10,8,14],[9,10,10,14],[4,3,4,14]]}
[1,null,null,"Revenue Account RFF"]
[]
[null,null,null,null,null,null,null,null,null,null,null,null,null,null,null,null,null,{"$f":"IF('Ring-Fenced Fund Adjustment'!D4=\"No\",\"Complete\",IF(COUNTIF(R16:R78,\"Incomplete\")>0,\"Incomplete\",\"Complete\"))","v":"Complete"}]
[]
[null,"Type of Ring-fenced Fund"]
[]
[null,"Details of Fund"]
[]
[null,null,null,"Quarter",null,null,null,null,null,null,"YTD"]
[null,null,null,null,null,{"$f":"'Revenue Account Total'!G5","v":"00:00:00"},null,null,null,null,{"$f":"F11","v":"00:00:00"}]
{"$rows_left_out":61}
{"sheet":"Investment Data","index":15,"n_rows":35,"n_cols":10,"rows_kept":35,"cut":false,"hidden":false,"merged":[[4,1,4,3],[4,4,4,6],[21,1,21,3],[21,4,21,6]]}
[1,null,null,null,null,"Investment Data"]
[]
[null,null,null,null,null,null,null,null,null,{"$f":"IF(COUNTIF(J5:J19,\"Incomplete\")>0,\"Incomplete\",\"Complete\")","v":"Complete"}]
[]
[null,"Assets by market value",null,null,"'000"]
[]
[null,null,"  (a) Government bonds",null,null,0,null,null,null,{"$f":"IF(OR(F7=\"\"),\"Incomplete\",\"Complete\")","v":"Complete"}]
[null,null,"  (b) Corporate bonds",null,null,0,null,null,null,{"$f":"IF(OR(F8=\"\"),\"Incomplete\",\"Complete\")","v":"Complete"}]
[null,null,"  (c) Type 1 equity",null,null,0,null,null,null,"Complete"]
[null,null,"  (d) True type 2 equity (see (h))",null,null,0,null,null,null,"Complete"]
{"$rows_left_out":26}
{"sheet":"Quarterly Industry Statistics","index":16,"n_rows":27,"n_cols":8,"rows_kept":27,"cut":false,"hidden":false,"merged":[[1,3,1,4],[6,4,7,4]]}
[1,null,null,"Quarterly Industry Statistics"]
[null,null,null,null,null,null,null,{"$f":"IF(COUNTIF(H13:H27,\"Incomplete\")>0,\"Incomplete\",\"Complete\")","v":"Complete"}]
[]
[]
[null,null,null,"Quarter","YTD"]
[]
[null,null,null,{"$f":"'Participant Information'!C12","v":"00:00:00"},{"$f":"D8","v":"00:00:00"}]
[null,"Premium Data ",null,{"$f":"QIS_YE_Date","v":"00:00:00"}]
[]
[]
{"$rows_left_out":18}
{"sheet":"Change Analysis","index":17,"n_rows":199,"n_cols":14,"rows_kept":199,"cut":false,"hidden":false,"merged":[[112,6,112,10],[113,6,113,10],[114,6,114,10],[115,6,115,10],[107,8,107,9]]}
[1,null,null,null,"Change Analysis"]
[]
[]
[null,"Tab requiring completion based on return type chosen:",null,null,{"$f":"IF(Control!$E$6=\"Annual\", \"Yes\",\"No\")","v":"No"},null,null,null,null,null,null,null,null,{"$f":"IF(E4=\"No\",\"Complete\",IF(COUNTIF(N9:N149,\"Incomplete\")>0,\"Incomplete\",\"Complete\"))","v":"Complete"}]
[]
[null,null,"Movement in Regulatory Balance Sheet",null,"Current Period",null,"Previous Period",null,"Change",null,"Commentary"]
[null,null,null,null,{"$f":"\"'000\"","v":"'000"},null,{"$f":"\"'000\"","v":"'000"},null,"%"]
[null,null,"Assets"]
[null,null,"Fixed assets",null,{"$f":"'Regulatory Balance Sheet'!F13","v":0},null,0,null,{"$f":"IF(E9=\"\",\"\",IF(ISERROR(E9/G9),0,E9/G9-1))","v":0},null,null,null,null,{"$f":"IF(OR(G9=\"\"),\"Incomplete\",\"Complete\")","v":"Complete"}]
[null,null,"Assets (other than assets held for unit-linked funds)",null,{"$f":"'Regulatory Balance Sheet'!F35","v":0},null,0,null,{"$f":"IF(E10=\"\",\"\",IF(ISERROR(E10/G10),0,E10/G10-1))","v":0},null,null,null,null,{"$f":"IF(OR(G10=\"\"),\"Incomplete\",\"Complete\")","v":"Complete"}]
{"$rows_left_out":190}
{"sheet":"Revenue Account Projected","index":18,"n_rows":87,"n_cols":27,"rows_kept":87,"cut":false,"hidden":false,"merged":[[5,3,5,7],[5,10,5,14],[5,17,5,21]]}
[1,null,null,"Revenue Account Projected"]
[]
[]
["Tab requiring completion based on return type chosen:",null,null,{"$f":"IF(Control!$E$6=\"Annual\", \"Yes\",\"No\")","v":"No"},null,null,null,null,null,null,null,null,null,null,null,null,null,null,null,null,null,null,null,null,null,null,{"$f":"IF(D4=\"No\",\"Complete\",IF(COUNTIF(AA13:AA102,\"Incomplete\")>0,\"Incomplete\",\"Complete\"))","v":"Complete"}]
[]
[null,null,null,"Plan+1",null,null,null,null,null,null,"Plan+2",null,null,null,null,null,null,"Plan+3",null,null,null,null,null,null,"Commentary"]
[]
[null,null,null,null,null,{"$f":"YEAR(QIS_YE_Date)+1","v":1901},null,null,null,null,null,null,{"$f":"YEAR(QIS_YE_Date)+2","v":1902},null,null,null,null,null,null,{"$f":"YEAR(QIS_YE_Date)+3","v":1903}]
[null,null,null,"Gross",null,"Reinsurer's share",null,"Net",null,null,"Gross",null,"Reinsurer's share",null,"Net",null,null,"Gross",null,"Reinsurer's share",null,"Net"]
[null,"Income",null,"'000",null,"'000",null,"'000",null,null,"'000",null,"'000",null,"'000",null,null,"'000",null,"'000",null,"'000"]
{"$rows_left_out":78}
{"sheet":"Expense Analysis","index":19,"n_rows":8,"n_cols":4,"rows_kept":8,"cut":false,"hidden":false,"merged":[[5,1,5,4]]}
[1,null,null,"Expense Analysis"]
[]
[]
[null,"Tab requiring completion based on return type chosen:",null,{"$f":"IF(Control!$E$6=\"Annual\", \"Yes\",\"No\")","v":"No"}]
[]
[null,"Expense Apportionment"]
[]
[null,"Please provide a description of the method of apportionment used to determine the breakdown of expenses incurred in the year preceding the valuation date between acquisition and renewal expenses:"]

{"sheet":"Annual Industry Statistics","index":20,"n_rows":26,"n_cols":15,"rows_kept":26,"cut":false,"hidden":false,"merged":[[1,11,1,12],[1,3,1,4],[1,5,1,6],[1,7,1,8],[1,9,1,10]]}
[1,null,null,"Annual Industry Statistics"]
[]
[]
[null,"Tab requiring completion based on return type chosen:",null,null,{"$f":"IF(Control!$E$6=\"Annual\", \"Yes\",\"No\")","v":"No"}]
[]
[null,"Annual new business premium data",null,{"$f":"QIS_YE_Date","v":"00:00:00"}]
[null,null,null,null,null,null,null,null,null,null,null,null,null,null,{"$f":"IF(E4=\"No\",\"Complete\",IF(COUNTIF(O13:O21,\"Incomplete\")>0,\"Incomplete\",\"Complete\"))","v":"Complete"}]
[]
[null,"New Business Premium - '000",null,"UK","Europe (ex UK)","Hong Kong","Singapore","Asia Other","Middle East","Latin America","Rest of World","Total"]
[]
{"$rows_left_out":17}
{"sheet":"Reinsurance Contracts","index":21,"n_rows":305,"n_cols":5,"rows_kept":305,"cut":false,"hidden":false,"merged":[[282,1,282,3],[32,1,32,3],[57,1,57,3],[82,1,82,3],[107,1,107,3],[132,1,132,3],[232,1,232,3],[257,1,257,3],[2,1,2,7],[7,1,7,3],[157,1,157,3],[182,1,182,3],[207,1,207,3],[5,1,5,7]]}
[1,null,"Reinsurance Contracts"]
[]
[]
[null,"Tab requiring completion based on return type chosen:",null,null,{"$f":"IF(Control!$E$6=\"Annual\", \"Yes\",\"No\")","v":"No"}]
[]
[null,"Please provide a detailed description by product of any reinsurance contracts, including finite and financial reinsurance, that are in force at the valuation date."]
[]
[null,"Reinsurance Contracts"]
[]
[null,"Product Name(s):"]
{"$rows_left_out":296}
{"sheet":"Insurance Obligations","index":22,"n_rows":390,"n_cols":18,"rows_kept":390,"cut":false,"hidden":false,"merged":[[388,1,389,1],[388,3,388,5],[388,7,388,9],[388,11,388,14],[388,15,388,17],[322,1,323,1],[322,3,322,5],[322,7,322,9],[322,11,322,14],[322,15,322,17],[355,1,356,1],[355,3,355,5],[355,7,355,9],[355,11,355,14],[355,15,355,17],[256,1,257,1],[256,3,256,5],[256,7,256,9],[256,11,256,14],[256,15,256,17],[289,1,290,1],[289,3,289,5],[289,7,289,9],[289,11,289,14],[289,15,289,17],[190,1,191,1],[190,3,190,5],[190,7,190,9],[190,11,190,14],[190,15,190,17],[223,1,224,1],[223,3,223,5],[223,7,223,9],[223,11,223,14],[223,15,223,17],[124,1,125,1],[124,3,124,5],[124,7,124,9],[124,11,124,14],[124,15,124,17],[157,1,158,1],[157,3,157,5],[157,7,157,9],[157,11,157,14],[157,15,157,17],[5,1,5,17],[91,1,92,1],[91,3,91,5],[91,7,91,9],[91,11,91,14],[91,15,91,17],[58,1,59,1],[58,3,58,5],[58,7,58,9],[58,11,58,14],[58,15,58,17],[25,15,25,17],[25,1,26,1],[25,3,25,5],[25,7,25,9],[25,11,25,14]]}
[1,null,null,null,null,"Insurance Obligations","2020-12-31"]
[]
[]
[null,"Tab requiring completion based on return type chosen:",null,null,null,{"$f":"IF(Control!$E$6=\"Annual\", \"Yes\",\"No\")","v":"No"}]
[null,"Insurers may either complete this tab or include the relevant information within their Actuary's Report required under Regulation 7. Please indicate if the Actuary's Report is providing this infomation:",null,null,null,null,null,null,null,null,null,null,null,"No"]
[null,"The information required in the table below need not be provided for contract types where the technical provisions at the valuation date in respect of that contract type represent less than 1% of the total technical provisions unless the insurer considers that the disclosure to the Authority is required."]
[]
[null,"Contract Type",null,"Premium and Benefit Description*",null,"Charges*",null,"Options and Guarantees*",null,"Other*"]
[]
[]
{"$rows_left_out":381}
{"sheet":"Data","index":23,"n_rows":162,"n_cols":17,"rows_kept":162,"cut":false,"hidden":false,"merged":[[95,1,95,2],[96,1,96,2],[97,1,97,2]]}
[1]
[]
[null,null,null,null,"Data"]
[null,"Currency","Currency Code"]
[null,"United Kingdom Pound","GBP"]
[null,"United States Dollar","USD"]
[null,"Euro","EUR"]
[null,"Sweden Krona","SEK"]
[null,"Afghanistan Afghani","AFN"]
[null,"Albania Lek","ALL"]
{"$rows_left_out":153}
{"sheet":"Raw Data","index":24,"n_rows":314,"n_cols":9,"rows_kept":314,"cut":false,"hidden":false,"merged":[]}
[1,null,null,"Raw Data"]
[]
[]
[null,"Sheet","Result",1,2,3,4,5,"Total"]
[]
[null,"Operational Risk Sheet","Current valuation date - Total  expenses for UL business",null,null,null,null,null,{"$f":"SUM(D6:H6)","v":0}]
[null,"Operational Risk Sheet","Current valuation date - Earned premiums ",null,null,null,null,null,{"$f":"SUM(D7:H7)","v":0}]
[null,"Operational Risk Sheet","Previous valuation date - Earned premiums ",null,null,null,null,null,0]
[null,"Operational Risk Sheet","Technical Provisions",null,null,null,null,null,0]
[]
{"$rows_left_out":305}
{"sheet":"Validation","index":25,"n_rows":17,"n_cols":8,"rows_kept":17,"cut":false,"hidden":true,"merged":[]}
["Sheet","Area of Sheet/s","Pass/Fail","Overall Pass/Fail","Return Version Number","Return Type & Name"]
[null,null,null,{"$f":"IF('Participant Information'!G9=\"Incomplete\",\"FAIL\",\"PASS\")","v":"FAIL"},{"$f":"'Participant Information'!E10","v":"V0.03"},{"$f":"VLOOKUP(E6&\"_\"&Control!E6,$D$10:$H$17,5,0)","v":"Prudential - Quarterly Return - Life 1, 2, 10 & 12"}]
[]
[]
[]
[null,null,null,"Return Class of template","LT"]
[null,null,null,"New Filename",{"$f":"IF(OR('Participant Information'!$C$11=\"\",'Participant Information'!$E$12=\"\",$D$2=\"FAIL\"),\"\",Control!E7&\"_\"&E6&\"_V\"&RIGHT(E2,2)&\"_\"&LEFT(VLOOKUP(E6&\"_\"&Control!E6,$D$10:$E$17,2,0),1)&TEXT('Participant Information'!$E$12,\"yyyymmdd\")&\".xlsx\")","v":""}]
[]
[null,null,null,"Key","Frequency","Atlas return name","Atlas return type","Return Type & Name"]
[null,null,null,"NLT-C13_Annual","Annual","Annual Return - Non-Life Class 13","Prudential",{"$f":"G10&\" - \"&F10","v":"Prudential - Annual Return - Non-Life Class 13"}]
{"$rows_left_out":7}